Jump to content


Photo

Harmony Patch 3.3.12 30 MAI

Others

  • Please log in to reply
107 replies to this topic

#21 Jezu

Jezu

    Advanced Member

  • Members
  • PipPipPip
  • 216 posts

Posted 11 December 2013 - 12:47 PM

Thanks a lot bro! ossi0110 !!

 

 

Btw, Hercules has anti wpe/rpe, pack with anti maya purple filter. And I hope, Ind make a protection to avoid speed hacks, spam filters, etc. 


6sum80.gif


#22 Tepoo

Tepoo

    Advanced Member

  • Members
  • PipPipPip
  • 142 posts

Posted 17 December 2013 - 11:05 PM

Thanks a lot bro! ossi0110 !!

 

 

Btw, Hercules has anti wpe/rpe, pack with anti maya purple filter. And I hope, Ind make a protection to avoid speed hacks, spam filters, etc. 

 

srsly, i dont understand this.

 

everyone pays these 200$ for Harmoney, does anyone checks whats possible without paying so much money?

with some easy steps (and with more less steps since the HPM Hook System) + some other tools you can avoid speed hacks, spam filters, bots, wpe/rpe and client modifications, without paying anyone anything.


2ro0olu.jpgL3lTAMR.gif


#23 Jezu

Jezu

    Advanced Member

  • Members
  • PipPipPip
  • 216 posts

Posted 18 December 2013 - 04:36 AM

Nothing you can do for now, only Harmony supports hercules svn. The prob is, Harmony doesn't update their src and this is the reason why Hercules community made this patch.


6sum80.gif


#24 ossi0110

ossi0110

    Advanced Member

  • Community Contributors
  • 587 posts
  • LocationGermany
  • Github:ossi0110

Posted 18 December 2013 - 12:58 PM

UPDATE

 

 

Added a New Full Patch V2 for 3.3.12  , what contains some Bug Fixes , and made the Patch Compatible to the latest Hercules Rev.

 

 

if you allready installed the Older Full Patch , you can Download the Small Fix Patch V2  to update your Harmony to V2.


Edited by ossi0110, 18 December 2013 - 12:58 PM.


#25 Jezu

Jezu

    Advanced Member

  • Members
  • PipPipPip
  • 216 posts

Posted 21 December 2013 - 10:00 AM

UPDATE

 

 

Added a New Full Patch V2 for 3.3.12  , what contains some Bug Fixes , and made the Patch Compatible to the latest Hercules Rev.

 

 

if you allready installed the Older Full Patch , you can Download the Small Fix Patch V2  to update your Harmony to V2.

 

 

THANKS A LOT BRO!! <3


6sum80.gif


#26 Thunderbolt

Thunderbolt

    Advanced Member

  • Members
  • PipPipPip
  • 90 posts
  • Github:Thunderbolt

Posted 22 December 2013 - 01:10 AM

Warning on hercules latest version, [color=rgb(40,40,40);font-family:helvetica, arial, sans-serif;]tested on Linux CentOs6[/color]

 

--1

Posted Image

 

 

--2

Posted Image

 

 

--3

Posted Image


Edited by Thunderbolt, 22 December 2013 - 01:11 AM.


#27 Shatowolf

Shatowolf

    Advanced Member

  • Members
  • PipPipPip
  • 128 posts

Posted 09 January 2014 - 02:14 PM

Warning on hercules latest version, [color=rgb(40,40,40);font-family:helvetica, arial, sans-serif;]tested on Linux CentOs6[/color]

 

--1

Posted Image

 

 

--2

Posted Image

 

 

--3

Posted Image

 

Tested and yea, you are correct.



#28 ossi0110

ossi0110

    Advanced Member

  • Community Contributors
  • 587 posts
  • LocationGermany
  • Github:ossi0110

Posted 09 January 2014 - 04:15 PM

hmm just tested it on a clean Hercules , dont got any Compiling errors ,  Compiled under VS 2010



#29 hemagx

hemagx

    Advanced Member

  • Former Core Developer
  • 229 posts
  • IRC Nickname:Ema
  • Emulator:Hercules
  • Github:hemagx

Posted 09 January 2014 - 09:19 PM

hmm just tested it on a clean Hercules , dont got any Compiling errors ,  Compiled under VS 2010

 

you need to do it under centos :)


Spoiler

Spoiler

Spoiler

Spoiler

Spoiler

Spoiler

Spoiler

Spoiler

Spoiler

#30 ossi0110

ossi0110

    Advanced Member

  • Community Contributors
  • 587 posts
  • LocationGermany
  • Github:ossi0110

Posted 09 January 2014 - 10:55 PM

ok will test it in th next days ,  need to setup a server on linux first



#31 ossi0110

ossi0110

    Advanced Member

  • Community Contributors
  • 587 posts
  • LocationGermany
  • Github:ossi0110

Posted 09 January 2014 - 11:58 PM

UPDATE Harmony_Full_3.3.12_V3

 

special thanks to

 

Haruna

 

 

All Compiling errors/Warnings fixed under Linux.   Tested with linux 64 Bit system ,  if someone use a 32 Bit system and still get errors pls report them.

 

Added a  Full Patch File Harmony_Full_3.3.12_V3.patch

 

Added a Small Fix file to upgrade an existing V2 patch to  V3

 

links have been added on first post


Edited by ossi0110, 10 January 2014 - 12:01 AM.


#32 zack

zack

    Newbie

  • Members
  • Pip
  • 7 posts

Posted 10 January 2014 - 04:38 AM

Bump.. Any Harmony 3.3.11 Patch from harmony? for Latest Hercules SVN because i tried manual patch its not working thanks..


Edited by zack, 10 January 2014 - 04:39 AM.


#33 Jezu

Jezu

    Advanced Member

  • Members
  • PipPipPip
  • 216 posts

Posted 10 January 2014 - 06:54 AM

Thanks a lot for continues updating this harmony patch @ ossi0110 !


6sum80.gif


#34 Milamber

Milamber

    Newbie

  • Members
  • Pip
  • 8 posts
  • Emulator:Hercules

Posted 13 January 2014 - 04:01 AM

Thanks a lot for harmony patch @ ossi0110 !

 

This can really be useful to many.

 

I / We really appreciate it.


Don't forget to click rep_up.png if i helped you!


#35 Feistz

Feistz

    Newbie

  • Members
  • Pip
  • 5 posts

Posted 19 January 2014 - 10:21 AM

New error. I think it is related with Harmony. Can you fix. Tested with the latest revision

 

4>d:ragnarok filesserver filesherculessrccommonsocket.c(495): warning C4013: 'do_close' undefined; assuming extern returning int3>d:ragnarok filesserver filesherculessrccommonsocket.c(495): warning C4013: 'do_close' undefined; assuming extern returning int2>d:ragnarok filesserver filesherculessrccommonsocket.c(495): warning C4013: 'do_close' undefined; assuming extern returning int4>d:ragnarok filesserver filesherculessrccommonsocket.c(1260): error C2371: 'do_close' : redefinition; different basic types4>d:ragnarok filesserver filesherculessrccommonsocket.c(1646): warning C4113: 'int (__cdecl *)()' differs in parameter lists from 'void (__cdecl *)(int)'3>d:ragnarok filesserver filesherculessrccommonsocket.c(1260): error C2371: 'do_close' : redefinition; different basic types3>d:ragnarok filesserver filesherculessrccommonsocket.c(1646): warning C4113: 'int (__cdecl *)()' differs in parameter lists from 'void (__cdecl *)(int)'2>d:ragnarok filesserver filesherculessrccommonsocket.c(1260): error C2371: 'do_close' : redefinition; different basic types2>d:ragnarok filesserver filesherculessrccommonsocket.c(1646): warning C4113: 'int (__cdecl *)()' differs in parameter lists from 'void (__cdecl *)(int)'

Edited by Feistz, 19 January 2014 - 10:22 AM.


#36 Feistz

Feistz

    Newbie

  • Members
  • Pip
  • 5 posts

Posted 20 January 2014 - 04:48 PM

New error. I think it is related with Harmony. Can you fix. Tested with the latest revision

 

4>d:ragnarok filesserver filesherculessrccommonsocket.c(495): warning C4013: 'do_close' undefined; assuming extern returning int3>d:ragnarok filesserver filesherculessrccommonsocket.c(495): warning C4013: 'do_close' undefined; assuming extern returning int2>d:ragnarok filesserver filesherculessrccommonsocket.c(495): warning C4013: 'do_close' undefined; assuming extern returning int4>d:ragnarok filesserver filesherculessrccommonsocket.c(1260): error C2371: 'do_close' : redefinition; different basic types4>d:ragnarok filesserver filesherculessrccommonsocket.c(1646): warning C4113: 'int (__cdecl *)()' differs in parameter lists from 'void (__cdecl *)(int)'3>d:ragnarok filesserver filesherculessrccommonsocket.c(1260): error C2371: 'do_close' : redefinition; different basic types3>d:ragnarok filesserver filesherculessrccommonsocket.c(1646): warning C4113: 'int (__cdecl *)()' differs in parameter lists from 'void (__cdecl *)(int)'2>d:ragnarok filesserver filesherculessrccommonsocket.c(1260): error C2371: 'do_close' : redefinition; different basic types2>d:ragnarok filesserver filesherculessrccommonsocket.c(1646): warning C4113: 'int (__cdecl *)()' differs in parameter lists from 'void (__cdecl *)(int)'

 

BUMP!



#37 ossi0110

ossi0110

    Advanced Member

  • Community Contributors
  • 587 posts
  • LocationGermany
  • Github:ossi0110

Posted 20 January 2014 - 10:50 PM

 

New error. I think it is related with Harmony. Can you fix. Tested with the latest revision

 

4>d:ragnarok filesserver filesherculessrccommonsocket.c(495): warning C4013: 'do_close' undefined; assuming extern returning int3>d:ragnarok filesserver filesherculessrccommonsocket.c(495): warning C4013: 'do_close' undefined; assuming extern returning int2>d:ragnarok filesserver filesherculessrccommonsocket.c(495): warning C4013: 'do_close' undefined; assuming extern returning int4>d:ragnarok filesserver filesherculessrccommonsocket.c(1260): error C2371: 'do_close' : redefinition; different basic types4>d:ragnarok filesserver filesherculessrccommonsocket.c(1646): warning C4113: 'int (__cdecl *)()' differs in parameter lists from 'void (__cdecl *)(int)'3>d:ragnarok filesserver filesherculessrccommonsocket.c(1260): error C2371: 'do_close' : redefinition; different basic types3>d:ragnarok filesserver filesherculessrccommonsocket.c(1646): warning C4113: 'int (__cdecl *)()' differs in parameter lists from 'void (__cdecl *)(int)'2>d:ragnarok filesserver filesherculessrccommonsocket.c(1260): error C2371: 'do_close' : redefinition; different basic types2>d:ragnarok filesserver filesherculessrccommonsocket.c(1646): warning C4113: 'int (__cdecl *)()' differs in parameter lists from 'void (__cdecl *)(int)'

 

BUMP!

 

 

i will fix this tomorrow when im back from work



#38 ossi0110

ossi0110

    Advanced Member

  • Community Contributors
  • 587 posts
  • LocationGermany
  • Github:ossi0110

Posted 21 January 2014 - 07:40 AM

UPDATE 2014-1-21

 

 

All Compiling errors/Warnings fixed & made the patch compatible to the latest rev

 

Added a  Full Patch File Harmony_Full_3.3.12_V4.patch

 

Added a Small Fix file to upgrade an existing V3 patch to  V4

 

links have been added on first post


Edited by ossi0110, 21 January 2014 - 07:42 AM.


#39 rafaelpsyco

rafaelpsyco

    Newbie

  • Members
  • Pip
  • 8 posts

Posted 26 January 2014 - 12:38 PM

Hii

I'm having the same error Jezu, what should I do?



#40 Shatowolf

Shatowolf

    Advanced Member

  • Members
  • PipPipPip
  • 128 posts

Posted 28 January 2014 - 03:08 PM

I got this on latest hercules.

 

harmony.c: In function 'harmony_action_request':harmony.c:327: error: 'struct atcommand_interface' has no member named 'parse'harmony.c:334: error: 'struct atcommand_interface' has no member named 'parse'make[1]: *** [obj_sql/harmony.o] Error 1make[1]: Leaving directory `/home/Hercules/trunk/src/map'make: *** [map_sql] Error 2 

 

 







Also tagged with one or more of these keywords: Others

0 user(s) are reading this topic

0 members, 0 guests, 0 anonymous users


This topic has been visited by 943 user(s)