Jump to content


Photo

Harmony Patch 3.3.12 30 MAI

Others

  • Please log in to reply
107 replies to this topic

#41 jTynne

jTynne

    Advanced Member

  • High Council
  • 241 posts
  • Emulator:Hercules

Posted 28 January 2014 - 04:32 PM

I got this on latest hercules.

 

harmony.c: In function 'harmony_action_request':harmony.c:327: error: 'struct atcommand_interface' has no member named 'parse'harmony.c:334: error: 'struct atcommand_interface' has no member named 'parse'make[1]: *** [obj_sql/harmony.o] Error 1make[1]: Leaving directory `/home/Hercules/trunk/src/map'make: *** [map_sql] Error 2 

Same :x



#42 ossi0110

ossi0110

    Advanced Member

  • Community Contributors
  • 587 posts
  • LocationGermany
  • Github:ossi0110

Posted 28 January 2014 - 04:40 PM

i will add later another fix patch ,  dont got a clean svn atm



#43 pr3p

pr3p

    Advanced Member

  • Members
  • PipPipPip
  • 279 posts
  • LocationUnited States
  • Emulator:Hercules

Posted 28 January 2014 - 10:45 PM

Awesome i'll test that too bro  ;)



#44 Shatowolf

Shatowolf

    Advanced Member

  • Members
  • PipPipPip
  • 139 posts

Posted 01 February 2014 - 10:25 AM

Any updates on this? :) thanks



#45 ossi0110

ossi0110

    Advanced Member

  • Community Contributors
  • 587 posts
  • LocationGermany
  • Github:ossi0110

Posted 01 February 2014 - 11:27 AM

Just change the 

 

 

atcommand->parse 

 

 

to

 

 

atcommand->exec 

 

 

in this file

 

 

harmony.c:327: error: 'struct atcommand_interface' has no member named 'parse'harmony.c:334: error: 'struct atcommand_interface' has no member named 'parse' 


#46 Shatowolf

Shatowolf

    Advanced Member

  • Members
  • PipPipPip
  • 139 posts

Posted 02 February 2014 - 12:45 PM

Anyone experience this? my sql info was correct.

 

[SQL]: DB error - Column count doesn't match value count at row 1[Debug]: at account_sql.c:642 - INSERT INTO `login` (`account_id`, `userid`, `user_pass`, `sex`, `email`, `group_id`, `state`, `unban_time`, `expiration_time`, `logincount`, `lastlogin`, `last_ip`, `birthdate`, `character_slots`, `pincode`, `pincode_change`,`last_mac`) VALUES (?, ?, ?, ?, ?, ?, ?, ?, ?, ?, ?, ?, ?, ?, ?, ?)


#47 Shatowolf

Shatowolf

    Advanced Member

  • Members
  • PipPipPip
  • 139 posts

Posted 03 February 2014 - 07:11 AM

Anyone? :(



#48 Xgear

Xgear

    Advanced Member

  • High Council
  • 250 posts

Posted 10 February 2014 - 05:14 AM

You have 17 fields and 16 ?. You need one more '?'.



#49 Alexandria

Alexandria

    Advanced Member

  • Members
  • PipPipPip
  • 340 posts
  • Locationlocalhost

Posted 07 March 2014 - 04:27 PM

[font="'comic sans ms', cursive;"][color=rgb(238,130,238);]Working with the latest Hercules version. :D[font="'comic sans ms', cursive;"][color=rgb(238,130,238);] [/color][/color][/font][/font]

 

[font="'comic sans ms', cursive;"][color=rgb(238,130,238);]I would like to leave a patch for fix this errors that I had.[/color][/font]

 

        CC      chat.c        CC      chrif.c        CC      clif.c        CC      date.c        CC      duel.c        CC      elemental.c        CC      guild.c        CC      harmony.charmony.c: In function ‘harmony_action_request’:harmony.c:327: error: ‘struct atcommand_interface’ has no member named ‘parse’harmony.c:334: error: ‘struct atcommand_interface’ has no member named ‘parse’make[1]: *** [obj_sql/harmony.o] Error 1make[1]: Leaving directory `/home/hercules784/Hercules/trunk/src/map'make: *** [map_sql] Error 2

 

Attached Files


3jJV0Bu.png


#50 Thunderbolt

Thunderbolt

    Advanced Member

  • Members
  • PipPipPip
  • 90 posts
  • Github:Thunderbolt

Posted 07 March 2014 - 04:44 PM

Just change the 

 

 

atcommand->parse 

 

 

to

 

 

atcommand->exec 

 

 

in this file

 

 

harmony.c:327: error: 'struct atcommand_interface' has no member named 'parse'harmony.c:334: error: 'struct atcommand_interface' has no member named 'parse' 

 

fix !!



#51 Shatowolf

Shatowolf

    Advanced Member

  • Members
  • PipPipPip
  • 139 posts

Posted 10 March 2014 - 07:20 AM

[font="'comic sans ms', cursive;"][color=rgb(238,130,238);]Working with the latest Hercules version. :D [/color][/font]

 

[font="'comic sans ms', cursive;"][color=rgb(238,130,238);]I would like to leave a patch for fix this errors that I had.[/color][/font]

 

        CC      chat.c        CC      chrif.c        CC      clif.c        CC      date.c        CC      duel.c        CC      elemental.c        CC      guild.c        CC      harmony.charmony.c: In function ‘harmony_action_request’:harmony.c:327: error: ‘struct atcommand_interface’ has no member named ‘parse’harmony.c:334: error: ‘struct atcommand_interface’ has no member named ‘parse’make[1]: *** [obj_sql/harmony.o] Error 1make[1]: Leaving directory `/home/hercules784/Hercules/trunk/src/map'make: *** [map_sql] Error 2

There a problem on last_mac, can't log in.

 

 

FIXED : I forgot to update the mmo.h :)

 

Thanks


Edited by Meigan, 10 March 2014 - 08:22 AM.


#52 xkickz

xkickz

    Newbie

  • Members
  • Pip
  • 3 posts

Posted 16 April 2014 - 08:02 AM

[color=rgb(102,102,0);][[/color]SQL[color=rgb(102,102,0);]]:[/color] DB error [color=rgb(102,102,0);]-[/color] [color=rgb(102,0,102);]Column[/color] count doesn[color=rgb(0,136,0);]'t match value count at row 1
[Debug]: at account_sql.c:642 - INSERT INTO `login` (`account_id`, `userid`, `user_pass`, `sex`, `email`, `group_id`, `state`, `unban_time`, `expiration_time`, `logincount`, `lastlogin`, `last_ip`, `birthdate`, `character_slots`, `pincode`, `pincode_change`,`last_mac`) VALUES (?, ?, ?, ?, ?, ?, ?, ?, ?, ?, ?, ?, ?, ?, ?, ?)[/color]

 

[color=rgb(0,136,0);]how to fix help me please[/color]

 

[color=rgb(0,136,0);]it appear when regis by _M _F[/color]



#53 evilpuncker

evilpuncker

    The Suggester

  • Community Contributors
  • 2122 posts
  • Locationbr br hue hue

Posted 16 April 2014 - 08:40 PM

[color=rgb(102,102,0);][[/color]SQL[color=rgb(102,102,0);]]:[/color] DB error [color=rgb(102,102,0);]-[/color] [color=rgb(102,0,102);]Column[/color] count doesn[color=rgb(0,136,0);]'t match value count at row 1
[Debug]: at account_sql.c:642 - INSERT INTO `login` (`account_id`, `userid`, `user_pass`, `sex`, `email`, `group_id`, `state`, `unban_time`, `expiration_time`, `logincount`, `lastlogin`, `last_ip`, `birthdate`, `character_slots`, `pincode`, `pincode_change`,`last_mac`) VALUES (?, ?, ?, ?, ?, ?, ?, ?, ?, ?, ?, ?, ?, ?, ?, ?)[/color]

 

[color=rgb(0,136,0);]how to fix help me please[/color]

 

[color=rgb(0,136,0);]it appear when regis by _M _F[/color]

 

[color=rgb(40,40,40);font-family:helvetica, arial, sans-serif;]You have 17 fields and 16 ?. You need one more '?'.[/color]


before asking for help, click here

some people that I admire:

Ai4rei (tools and client stuff) • Aeomin (the awesome thor patcher) • AnnieRuru (very helpful with script and source stuff)

Neo (N.E.M.O... do I need to say more?) • KeyWord (roBrowser <3) • k3dt (clients and clients) • Tokeiburu (awesome tools)

Dastgir (lua stuff) • Yommy • Ind • Haru • malufett

 

:ok:    and everyone that contributed in any way to the *Athena community in general (emulator, releases, support etc)  :no1: 


#54 xkickz

xkickz

    Newbie

  • Members
  • Pip
  • 3 posts

Posted 17 April 2014 - 07:45 AM

[color=rgb(102,102,0);][[/color]SQL[color=rgb(102,102,0);]]:[/color] DB error [color=rgb(102,102,0);]-[/color] [color=rgb(102,0,102);]Column[/color] count doesn[color=rgb(0,136,0);]'t match value count at row 1
[Debug]: at account_sql.c:642 - INSERT INTO `login` (`account_id`, `userid`, `user_pass`, `sex`, `email`, `group_id`, `state`, `unban_time`, `expiration_time`, `logincount`, `lastlogin`, `last_ip`, `birthdate`, `character_slots`, `pincode`, `pincode_change`,`last_mac`) VALUES (?, ?, ?, ?, ?, ?, ?, ?, ?, ?, ?, ?, ?, ?, ?, ?)[/color]

 

[color=rgb(0,136,0);]how to fix help me please[/color]

 

[color=rgb(0,136,0);]it appear when regis by _M _F[/color]

 

[color=rgb(40,40,40);font-family:helvetica, arial, sans-serif;]You have 17 fields and 16 ?. You need one more '?'.[/color]

 

where to fix it please tell me ..



#55 Thunderbolt

Thunderbolt

    Advanced Member

  • Members
  • PipPipPip
  • 90 posts
  • Github:Thunderbolt

Posted 17 April 2014 - 10:37 AM

Unknow pack 0x264 after install Harmony patch on latest hercules. 



#56 evilpuncker

evilpuncker

    The Suggester

  • Community Contributors
  • 2122 posts
  • Locationbr br hue hue

Posted 17 April 2014 - 03:57 PM

 

[color=rgb(102,102,0);][[/color]SQL[color=rgb(102,102,0);]]:[/color] DB error [color=rgb(102,102,0);]-[/color] [color=rgb(102,0,102);]Column[/color] count doesn[color=rgb(0,136,0);]'t match value count at row 1
[Debug]: at account_sql.c:642 - INSERT INTO `login` (`account_id`, `userid`, `user_pass`, `sex`, `email`, `group_id`, `state`, `unban_time`, `expiration_time`, `logincount`, `lastlogin`, `last_ip`, `birthdate`, `character_slots`, `pincode`, `pincode_change`,`last_mac`) VALUES (?, ?, ?, ?, ?, ?, ?, ?, ?, ?, ?, ?, ?, ?, ?, ?)[/color]

 

[color=rgb(0,136,0);]how to fix help me please[/color]

 

[color=rgb(0,136,0);]it appear when regis by _M _F[/color]

 

[color=rgb(40,40,40);font-family:helvetica, arial, sans-serif;]You have 17 fields and 16 ?. You need one more '?'.[/color]

 

where to fix it please tell me ..

 

account_sql.c I guess


before asking for help, click here

some people that I admire:

Ai4rei (tools and client stuff) • Aeomin (the awesome thor patcher) • AnnieRuru (very helpful with script and source stuff)

Neo (N.E.M.O... do I need to say more?) • KeyWord (roBrowser <3) • k3dt (clients and clients) • Tokeiburu (awesome tools)

Dastgir (lua stuff) • Yommy • Ind • Haru • malufett

 

:ok:    and everyone that contributed in any way to the *Athena community in general (emulator, releases, support etc)  :no1: 


#57 xkickz

xkickz

    Newbie

  • Members
  • Pip
  • 3 posts

Posted 17 April 2014 - 11:33 PM

ok i found how to fix

in [color=rgb(40,40,40);font-family:helvetica, arial, sans-serif;]account_sql.c[/color]

add ,? red color thank you very much

 

"INSERT INTO `%s` (`account_id`, `userid`, `user_pass`, `sex`, `email`, `group_id`, `state`, `unban_time`, `expiration_time`, `logincount`, `lastlogin`, `last_ip`, `birthdate`, `character_slots`, `pincode`, `pincode_change`) VALUES (?, ?, ?, ?, ?, ?, ?, ?, ?, ?, ?, ?, ?, ?, ?, ?[color=#ff0000], ?)[/color]",



#58 Alexandria

Alexandria

    Advanced Member

  • Members
  • PipPipPip
  • 340 posts
  • Locationlocalhost

Posted 24 April 2014 - 08:43 PM

[font="'comic sans ms', cursive;"][color=rgb(238,130,238);]Atcommand.c and Core.c and other files are outdates for the newest hercules version. Please, update the patch.[/color][/font]

 

[font="'comic sans ms', cursive;"][color=rgb(238,130,238);]Thank you.[/color][/font]


3jJV0Bu.png


#59 Lelouch

Lelouch

    Advanced Member

  • Members
  • PipPipPip
  • 68 posts
  • LocationArea 11
  • Emulator:Hercules
  • Github:lelouch22

Posted 05 May 2014 - 11:34 AM

Any updates??



#60 Alexandria

Alexandria

    Advanced Member

  • Members
  • PipPipPip
  • 340 posts
  • Locationlocalhost

Posted 19 May 2014 - 08:27 PM

[font="'comic sans ms', cursive;"][color=rgb(238,130,238);]If you guys are looking for an update, you can find out here:[/color][/font]

 

http://herc.ws/board...y-patch-update/


3jJV0Bu.png






Also tagged with one or more of these keywords: Others

0 user(s) are reading this topic

0 members, 0 guests, 0 anonymous users


This topic has been visited by 955 user(s)