Jump to content

Search the Community

Showing results for tags 'compiling'.



More search options

  • Search By Tags

    Type tags separated by commas.
  • Search By Author

Content Type


Forums

  • Bulletin Centre
    • Community News
    • Repository News
    • Ragnarok News
  • Hercules Development Centre
    • Development Discussion
    • Suggestions
    • Development Centre Archives
  • Support & Releases
    • General Server Support
    • Database
    • Scripting
    • Source
    • Plugin
    • Client-Side
    • Graphic Enhancements
    • Other Support & Releases
  • Hercules Community
    • General Discussion
    • Projects
    • Employment
    • Server Advertisement
    • Arts & Writings
    • Off Topic
  • 3CeAM Centre
    • News and Development
    • Community
  • International Communities
    • Filipino Community
    • Portuguese Community
    • Spanish Community
    • Other Communities

Categories

  • Client Resources
  • Graphic Resources
    • Sprites & Palettes
    • Maps & Textures
    • Other Graphics
  • Server Resources
    • Server Managers / Editors Releases
    • Script Releases
    • Source Modifications
    • Plugins
    • Pre-Compiled Server
  • Web Resources

Find results in...

Find results that contain...


Date Created

  • Start

    End


Last Updated

  • Start

    End


Filter by number of...

Joined

  • Start

    End


Group


Discord


Skype


IRC Nickname


Website URL


Location:


Interests


Github

Found 2 results

  1. Good evening, As a yellow boned user of eAthena, a friend of mine that always comes over to ask me to help him out with server errors since Jesus's Birth, has come today once more showing me this. CC inter.cinter.c: In function âgeoip_initâ:inter.c:487: error: âerrnoâ undeclared (first use in this function)inter.c:487: error: (Each undeclared identifier is reported only onceinter.c:487: error: for each function it appears in.)inter.c:500: warning: implicit declaration of function âlseekâinter.c:502: warning: implicit declaration of function âreadâmake[1]: *** [obj_sql/inter.o] Error 1make[1]: Leaving directory `/home/emulador/new-install/src/char'make: *** [char_sql] Error 2 This is the very first time i've seen something like this, mostly of the time users forget to install some 'devel' lib or something, but the system has every package installed properly. Also, i re-downloaded a git clone in a new dir and still, we don't seem to be able to compile it. I'm not used to ask people for support, but today is one of those days. Thanks in advance.
  2. Is there anyone having a problem compiling a fresh checked out server with cygwin? Haven't experience this error with CentOS and MSVC++ 2010.
×
×
  • Create New...

Important Information

By using this site, you agree to our Terms of Use.